
8 Jan
2020
8 Jan
'20
2:46 p.m.
See <https://ci.centos.org/job/gtk-vnc+mingw64-build/systems=libvirt-fedora-30/2/display/redirect> ------------------------------------------ Started by upstream project "gtk-vnc+mingw64-build" build number 2 originally caused by: Started by user Libvirt Running as SYSTEM [EnvInject] - Loading node environment variables. Building remotely on libvirt-fedora-30 (libvirt) in workspace <https://ci.centos.org/job/gtk-vnc+mingw64-build/systems=libvirt-fedora-30/ws/> No credentials specified > git rev-parse --is-inside-work-tree # timeout=10 Fetching changes from the remote Git repository > git config remote.origin.url https://gitlab.gnome.org/GNOME/gtk-vnc.git # timeout=10 Fetching upstream changes from https://gitlab.gnome.org/GNOME/gtk-vnc.git > git --version # timeout=10 > git fetch --tags --force --progress https://gitlab.gnome.org/GNOME/gtk-vnc.git +refs/heads/*:refs/remotes/origin/* Checking out Revision 423405a724645f1b205ca86d39397cfcb6fb1461 (refs/remotes/origin/master) > git config core.sparsecheckout # timeout=10 > git checkout -f 423405a724645f1b205ca86d39397cfcb6fb1461 Commit message: "Relax min x11 dep for Debian 9 portability" > git rev-list --no-walk 423405a724645f1b205ca86d39397cfcb6fb1461 # timeout=10 Cleaning workspace > git rev-parse --verify HEAD # timeout=10 Resetting working tree > git reset --hard # timeout=10 > git clean -fdx # timeout=10 [gtk-vnc+mingw64] $ /bin/sh -xe /tmp/jenkins10823000899786290457.sh + export VIRT_PREFIX=/home/jenkins/build/libvirt/x86_64-w64-mingw32/sys-root/mingw + VIRT_PREFIX=/home/jenkins/build/libvirt/x86_64-w64-mingw32/sys-root/mingw + export PKG_CONFIG_PATH=/home/jenkins/build/libvirt/x86_64-w64-mingw32/sys-root/mingw/lib/pkgconfig + PKG_CONFIG_PATH=/home/jenkins/build/libvirt/x86_64-w64-mingw32/sys-root/mingw/lib/pkgconfig + export PKG_CONFIG_LIBDIR=/usr/x86_64-w64-mingw32/sys-root/mingw/lib/pkgconfig:/usr/x86_64-w64-mingw32/sys-root/mingw/share/pkgconfig + PKG_CONFIG_LIBDIR=/usr/x86_64-w64-mingw32/sys-root/mingw/lib/pkgconfig:/usr/x86_64-w64-mingw32/sys-root/mingw/share/pkgconfig + rm -rf build + mkdir build + cd build + meson .. . --prefix=/home/jenkins/build/libvirt/x86_64-w64-mingw32/sys-root/mingw --cross-file=/usr/share/mingw/toolchain-mingw64.meson The Meson build system Version: 0.52.0 Source dir: <https://ci.centos.org/job/gtk-vnc+mingw64-build/systems=libvirt-fedora-30/ws/> Build dir: <https://ci.centos.org/job/gtk-vnc+mingw64-build/systems=libvirt-fedora-30/ws/build> Build type: cross build Project name: gtk-vnc Project version: 1.0.0 C compiler for the build machine: ccache cc (gcc 9.2.1 "cc (GCC) 9.2.1 20190827 (Red Hat 9.2.1-1)") C linker for the build machine: GNU ld.bfd 2.31.1-36 C compiler for the host machine: /usr/bin/x86_64-w64-mingw32-gcc (gcc 8.3.0 "x86_64-w64-mingw32-gcc (GCC) 8.3.0 20190222 (Fedora MinGW 8.3.0-2.fc30)") C linker for the host machine: GNU ld.bfd 2.30 Build machine cpu family: x86_64 Build machine cpu: x86_64 Host machine cpu family: x86_64 Host machine cpu: x86_64 Target machine cpu family: x86_64 Target machine cpu: x86_64 Program build-aux/dist.sh found: YES (/bin/sh <https://ci.centos.org/job/gtk-vnc+mingw64-build/systems=libvirt-fedora-30/ws/build-aux/dist.sh)> Program <https://ci.centos.org/job/gtk-vnc+mingw64-build/systems=libvirt-fedora-30/ws/build-aux/syntax-check> found: YES (/bin/sh <https://ci.centos.org/job/gtk-vnc+mingw64-build/systems=libvirt-fedora-30/ws/build-aux/syntax-check)> Program pod2man found: YES (/usr/bin/pod2man) Found pkg-config: /usr/bin/x86_64-w64-mingw32-pkg-config (0.28) Run-time dependency gobject-2.0 found: YES 2.58.3 Run-time dependency gio-2.0 found: YES 2.58.3 Found CMake: NO Run-time dependency gio-unix-2.0 found: NO (tried pkgconfig and cmake) Run-time dependency gthread-2.0 found: YES 2.58.3 Run-time dependency gdk-pixbuf-2.0 found: YES 2.36.11 Run-time dependency gtk+-3.0 found: YES 3.22.30 DEPRECATION: No entry for libgcrypt-config specified in your cross file. Falling back to searching PATH. This may find a native version of libgcrypt-config! This will become a hard error in a future version of meson libgcrypt-config found: YES (/usr/bin/libgcrypt-config) 1.8.5 Run-time dependency libgcrypt found: YES 1.8.5 Run-time dependency gnutls found: YES 3.6.3 Run-time dependency cairo found: YES 1.14.10 Run-time dependency x11 found: NO (tried pkgconfig and cmake) Run-time dependency libpulse-simple found: NO (tried pkgconfig and cmake) Run-time dependency zlib found: YES 1.2.5 Run-time dependency libsasl2 found: NO (tried pkgconfig and cmake) |Executing subproject keycodemapdb method meson | |Project name: keycodemapdb |Project version: undefined |Build targets in project: 0 |Subproject keycodemapdb finished. Compiler for C supports arguments -W: YES Compiler for C supports arguments -Waddress: YES Compiler for C supports arguments -Waggressive-loop-optimizations: YES Compiler for C supports arguments -Wall: YES Compiler for C supports arguments -Warray-bounds: YES Compiler for C supports arguments -Wattributes: YES Compiler for C supports arguments -Wbuiltin-macro-redefined: YES Compiler for C supports arguments -Wchar-subscripts: YES Compiler for C supports arguments -Wclobbered: YES Compiler for C supports arguments -Wcomment: YES Compiler for C supports arguments -Wcomments: YES Compiler for C supports arguments -Wcoverage-mismatch: YES Compiler for C supports arguments -Wcpp: YES Compiler for C supports arguments -Wdate-time: YES Compiler for C supports arguments -Wno-deprecated-declarations -Wdeprecated-declarations: YES Compiler for C supports arguments -Wdisabled-optimization: YES Compiler for C supports arguments -Wdiv-by-zero: YES Compiler for C supports arguments -Wdouble-promotion: YES Compiler for C supports arguments -Wempty-body: YES Compiler for C supports arguments -Wendif-labels: YES Compiler for C supports arguments -Wenum-compare: YES Compiler for C supports arguments -Wextra: YES Compiler for C supports arguments -Wformat-contains-nul: YES Compiler for C supports arguments -Wformat-extra-args: YES Compiler for C supports arguments -Wformat-security: YES Compiler for C supports arguments -Wformat-y2k: YES Compiler for C supports arguments -Wformat-zero-length: YES Compiler for C supports arguments -Wfree-nonheap-object: YES Compiler for C supports arguments -Wignored-qualifiers: YES Compiler for C supports arguments -Wimplicit: YES Compiler for C supports arguments -Wimplicit-function-declaration: YES Compiler for C supports arguments -Wimplicit-int: YES Compiler for C supports arguments -Winit-self: YES Compiler for C supports arguments -Winline: YES Compiler for C supports arguments -Wint-to-pointer-cast: YES Compiler for C supports arguments -Winvalid-memory-model: YES Compiler for C supports arguments -Winvalid-pch: YES Compiler for C supports arguments -Wjump-misses-init: YES Compiler for C supports arguments -Wlogical-op: YES Compiler for C supports arguments -Wmain: YES Compiler for C supports arguments -Wmaybe-uninitialized: YES Compiler for C supports arguments -Wmissing-braces: YES Compiler for C supports arguments -Wmissing-declarations: YES Compiler for C supports arguments -Wmissing-field-initializers: YES Compiler for C supports arguments -Wmissing-parameter-type: YES Compiler for C supports arguments -Wmissing-prototypes: YES Compiler for C supports arguments -Wmultichar: YES Compiler for C supports arguments -Wnarrowing: YES Compiler for C supports arguments -Wnested-externs: YES Compiler for C supports arguments -Wnonnull: YES Compiler for C supports arguments -Wold-style-declaration: YES Compiler for C supports arguments -Wold-style-definition: YES Compiler for C supports arguments -Wopenmp-simd: YES Compiler for C supports arguments -Woverflow: YES Compiler for C supports arguments -Woverride-init: YES Compiler for C supports arguments -Wpacked: YES Compiler for C supports arguments -Wpacked-bitfield-compat: YES Compiler for C supports arguments -Wparentheses: YES Compiler for C supports arguments -Wpointer-arith: YES Compiler for C supports arguments -Wpointer-sign: YES Compiler for C supports arguments -Wpointer-to-int-cast: YES Compiler for C supports arguments -Wpragmas: YES Compiler for C supports arguments -Wreturn-local-addr: YES Compiler for C supports arguments -Wreturn-type: YES Compiler for C supports arguments -Wsequence-point: YES Compiler for C supports arguments -Wshadow: YES Compiler for C supports arguments -Wsizeof-pointer-memaccess: YES Compiler for C supports arguments -Wstack-protector: YES Compiler for C supports arguments -Wstrict-aliasing: YES Compiler for C supports arguments -Wstrict-overflow: YES Compiler for C supports arguments -Wstrict-prototypes: YES Compiler for C supports arguments -Wsuggest-attribute=const: YES Compiler for C supports arguments -Wsuggest-attribute=format: YES Compiler for C supports arguments -Wsuggest-attribute=noreturn: YES Compiler for C supports arguments -Wsuggest-attribute=pure: YES Compiler for C supports arguments -Wswitch: YES Compiler for C supports arguments -Wswitch-default: YES Compiler for C supports arguments -Wsync-nand: YES Compiler for C supports arguments -Wtrampolines: YES Compiler for C supports arguments -Wtrigraphs: YES Compiler for C supports arguments -Wtype-limits: YES Compiler for C supports arguments -Wuninitialized: YES Compiler for C supports arguments -Wunknown-pragmas: YES Compiler for C supports arguments -Wunsafe-loop-optimizations: YES Compiler for C supports arguments -Wunused: YES Compiler for C supports arguments -Wunused-but-set-parameter: YES Compiler for C supports arguments -Wunused-but-set-variable: YES Compiler for C supports arguments -Wunused-function: YES Compiler for C supports arguments -Wunused-label: YES Compiler for C supports arguments -Wunused-local-typedefs: YES Compiler for C supports arguments -Wunused-parameter: YES Compiler for C supports arguments -Wunused-result: YES Compiler for C supports arguments -Wunused-value: YES Compiler for C supports arguments -Wunused-variable: YES Compiler for C supports arguments -Wvarargs: YES Compiler for C supports arguments -Wvariadic-macros: YES Compiler for C supports arguments -Wvector-operation-performance: YES Compiler for C supports arguments -Wvla: YES Compiler for C supports arguments -Wvolatile-register-var: YES Compiler for C supports arguments -Wwrite-strings: YES Compiler for C supports arguments -Wnormalized=nfc: YES Compiler for C supports arguments -Wno-sign-compare -Wsign-compare: YES Compiler for C supports arguments -Wno-sign-conversion -Wsign-conversion: YES Compiler for C supports arguments -Wno-conversion -Wconversion: YES Compiler for C supports arguments -Wno-unsafe-loop-optimizations -Wunsafe-loop-optimizations: YES Compiler for C supports arguments -Wno-cast-function-type -Wcast-function-type: YES Compiler for C supports arguments -Wjump-misses-init: YES (cached) Compiler for C supports arguments -Wframe-larger-than=40096: YES Compiler for C supports arguments -O2: YES Compiler for C supports arguments -Wp,-D_FORTIFY_SOURCE=2: YES Compiler for C supports arguments -fexceptions: YES Compiler for C supports arguments -fasynchronous-unwind-tables: YES Compiler for C supports arguments -fdiagnostics-show-option: YES Compiler for C supports arguments -funit-at-a-time: YES Compiler for C supports arguments -fipa-pure-const: YES Compiler for C supports arguments -Wno-suggest-attribute=pure -Wsuggest-attribute=pure: YES Compiler for C supports arguments -Wno-suggest-attribute=const -Wsuggest-attribute=const: YES WARNING: Consider using the builtin warning_level option instead of adding warning flags by hand. WARNING: Consider using the builtin warning_level option instead of adding warning flags by hand. WARNING: Consider using the builtin optimization level rather than adding flags by hand. Configuring config.h using configuration Found pkg-config: /usr/bin/pkg-config (1.6.1) Compiler for C supports link arguments -Wl,--no-undefined: YES Program python3 found: YES (/usr/bin/python3) Compiler for C supports link arguments -Wl,--no-undefined: YES (cached) Program pod2man found: YES (/usr/bin/pod2man) Configuring gvnc-1.0.pc using configuration Configuring gtk-vnc-2.0.pc using configuration Configuring gtk-vnc.spec using configuration Configuring mingw-gtk-vnc.spec using configuration Build targets in project: 22 Found ninja-1.9.0 at /usr/bin/ninja + /usr/bin/ninja [1/50] Generating vncmarshal_c with a custom command. INFO: Reading ../src/vncmarshal.txt... [2/50] Generating vncmarshal_h with a custom command. INFO: Reading ../src/vncmarshal.txt... [3/50] Generating vncconnectionenums.h with a meson_exe.py custom command. [4/50] Generating vncdisplayenums.h with a meson_exe.py custom command. [5/50] Generating vncconnectionenums.c with a meson_exe.py custom command. [6/50] Compiling C object 'src/25a6634@@gvnc-1.0@sha/vncutil.c.obj'. [7/50] Compiling C object 'src/25a6634@@gvnc-1.0@sha/vncaudioformat.c.obj'. [8/50] Compiling C object 'src/25a6634@@gvnc-1.0@sha/meson-generated_.._vncmarshal.c.obj'. [9/50] Compiling C object 'src/25a6634@@gvnc-1.0@sha/vncaudiosample.c.obj'. [10/50] Compiling C object 'src/25a6634@@gvnc-1.0@sha/meson-generated_.._vncconnectionenums.c.obj'. [11/50] Compiling C object 'src/25a6634@@gvnc-1.0@sha/vncaudio.c.obj'. [12/50] Compiling C object 'src/25a6634@@gvnc-1.0@sha/vncpixelformat.c.obj'. [13/50] Compiling C object 'src/25a6634@@gvnc-1.0@sha/vncbaseaudio.c.obj'. [14/50] Compiling C object 'src/25a6634@@gvnc-1.0@sha/vncframebuffer.c.obj'. [15/50] Compiling C object 'src/25a6634@@gvnc-1.0@sha/vnccursor.c.obj'. [16/50] Compiling C object 'src/25a6634@@gvnc-1.0@sha/vnccolormap.c.obj'. [17/50] Compiling C object 'src/25a6634@@gvnc-1.0@sha/dh.c.obj'. FAILED: src/25a6634@@gvnc-1.0@sha/dh.c.obj /usr/bin/x86_64-w64-mingw32-gcc -Isrc/25a6634@@gvnc-1.0@sha -Isrc -I../src -I. -I../ -I/usr/x86_64-w64-mingw32/sys-root/mingw/include/glib-2.0 -I/usr/x86_64-w64-mingw32/sys-root/mingw/lib/glib-2.0/include -I/usr/x86_64-w64-mingw32/sys-root/mingw/include -I/usr/x86_64-w64-mingw32/sys-root/mingw/include/gdk-pixbuf-2.0 -I/usr/x86_64-w64-mingw32/sys-root/mingw/include/libpng16 -I/usr/x86_64-w64-mingw32/sys-root/mingw/include/p11-kit-1 -fdiagnostics-color=always -pipe -Wall -Winvalid-pch -std=gnu99 -O2 -g -W -Waddress -Waggressive-loop-optimizations -Wall -Warray-bounds -Wattributes -Wbuiltin-macro-redefined -Wchar-subscripts -Wclobbered -Wcomment -Wcomments -Wcoverage-mismatch -Wcpp -Wdate-time -Wno-deprecated-declarations -Wdisabled-optimization -Wdiv-by-zero -Wdouble-promotion -Wempty-body -Wendif-labels -Wenum-compare -Wextra -Wformat-contains-nul -Wformat-extra-args -Wformat-security -Wformat-y2k -Wformat-zero-length -Wfree-nonheap-object -Wignored-qualifiers -Wimplicit -Wimplicit-function-declaration -Wimplicit-int -Winit-self -Winline -Wint-to-pointer-cast -Winvalid-memory-model -Winvalid-pch -Wjump-misses-init -Wlogical-op -Wmain -Wmaybe-uninitialized -Wmissing-braces -Wmissing-declarations -Wmissing-field-initializers -Wmissing-parameter-type -Wmissing-prototypes -Wmultichar -Wnarrowing -Wnested-externs -Wnonnull -Wold-style-declaration -Wold-style-definition -Wopenmp-simd -Woverflow -Woverride-init -Wpacked -Wpacked-bitfield-compat -Wparentheses -Wpointer-arith -Wpointer-sign -Wpointer-to-int-cast -Wpragmas -Wreturn-local-addr -Wreturn-type -Wsequence-point -Wshadow -Wsizeof-pointer-memaccess -Wstack-protector -Wstrict-aliasing -Wstrict-overflow -Wstrict-prototypes -Wsuggest-attribute=const -Wsuggest-attribute=format -Wsuggest-attribute=noreturn -Wsuggest-attribute=pure -Wswitch -Wswitch-default -Wsync-nand -Wtrampolines -Wtrigraphs -Wtype-limits -Wuninitialized -Wunknown-pragmas -Wunsafe-loop-optimizations -Wunused -Wunused-but-set-parameter -Wunused-but-set-variable -Wunused-function -Wunused-label -Wunused-local-typedefs -Wunused-parameter -Wunused-result -Wunused-value -Wunused-variable -Wvarargs -Wvariadic-macros -Wvector-operation-performance -Wvla -Wvolatile-register-var -Wwrite-strings -Wnormalized=nfc -Wno-sign-compare -Wno-sign-conversion -Wno-conversion -Wno-unsafe-loop-optimizations -Wno-cast-function-type -Wjump-misses-init -Wframe-larger-than=40096 -O2 -Wp,-D_FORTIFY_SOURCE=2 -fexceptions -fasynchronous-unwind-tables -fdiagnostics-show-option -funit-at-a-time -fipa-pure-const -Wno-suggest-attribute=pure -Wno-suggest-attribute=const -mms-bitfields -mms-bitfields -mms-bitfields -MD -MQ 'src/25a6634@@gvnc-1.0@sha/dh.c.obj' -MF 'src/25a6634@@gvnc-1.0@sha/dh.c.obj.d' -o 'src/25a6634@@gvnc-1.0@sha/dh.c.obj' -c ../src/dh.c In file included from ../src/dh.c:25: ../src/dh.h:25:10: fatal error: gcrypt.h: No such file or directory #include <gcrypt.h> ^~~~~~~~~~ compilation terminated. [18/50] Compiling C object 'src/25a6634@@gvnc-1.0@sha/vncconnection.c.obj'. FAILED: src/25a6634@@gvnc-1.0@sha/vncconnection.c.obj /usr/bin/x86_64-w64-mingw32-gcc -Isrc/25a6634@@gvnc-1.0@sha -Isrc -I../src -I. -I../ -I/usr/x86_64-w64-mingw32/sys-root/mingw/include/glib-2.0 -I/usr/x86_64-w64-mingw32/sys-root/mingw/lib/glib-2.0/include -I/usr/x86_64-w64-mingw32/sys-root/mingw/include -I/usr/x86_64-w64-mingw32/sys-root/mingw/include/gdk-pixbuf-2.0 -I/usr/x86_64-w64-mingw32/sys-root/mingw/include/libpng16 -I/usr/x86_64-w64-mingw32/sys-root/mingw/include/p11-kit-1 -fdiagnostics-color=always -pipe -Wall -Winvalid-pch -std=gnu99 -O2 -g -W -Waddress -Waggressive-loop-optimizations -Wall -Warray-bounds -Wattributes -Wbuiltin-macro-redefined -Wchar-subscripts -Wclobbered -Wcomment -Wcomments -Wcoverage-mismatch -Wcpp -Wdate-time -Wno-deprecated-declarations -Wdisabled-optimization -Wdiv-by-zero -Wdouble-promotion -Wempty-body -Wendif-labels -Wenum-compare -Wextra -Wformat-contains-nul -Wformat-extra-args -Wformat-security -Wformat-y2k -Wformat-zero-length -Wfree-nonheap-object -Wignored-qualifiers -Wimplicit -Wimplicit-function-declaration -Wimplicit-int -Winit-self -Winline -Wint-to-pointer-cast -Winvalid-memory-model -Winvalid-pch -Wjump-misses-init -Wlogical-op -Wmain -Wmaybe-uninitialized -Wmissing-braces -Wmissing-declarations -Wmissing-field-initializers -Wmissing-parameter-type -Wmissing-prototypes -Wmultichar -Wnarrowing -Wnested-externs -Wnonnull -Wold-style-declaration -Wold-style-definition -Wopenmp-simd -Woverflow -Woverride-init -Wpacked -Wpacked-bitfield-compat -Wparentheses -Wpointer-arith -Wpointer-sign -Wpointer-to-int-cast -Wpragmas -Wreturn-local-addr -Wreturn-type -Wsequence-point -Wshadow -Wsizeof-pointer-memaccess -Wstack-protector -Wstrict-aliasing -Wstrict-overflow -Wstrict-prototypes -Wsuggest-attribute=const -Wsuggest-attribute=format -Wsuggest-attribute=noreturn -Wsuggest-attribute=pure -Wswitch -Wswitch-default -Wsync-nand -Wtrampolines -Wtrigraphs -Wtype-limits -Wuninitialized -Wunknown-pragmas -Wunsafe-loop-optimizations -Wunused -Wunused-but-set-parameter -Wunused-but-set-variable -Wunused-function -Wunused-label -Wunused-local-typedefs -Wunused-parameter -Wunused-result -Wunused-value -Wunused-variable -Wvarargs -Wvariadic-macros -Wvector-operation-performance -Wvla -Wvolatile-register-var -Wwrite-strings -Wnormalized=nfc -Wno-sign-compare -Wno-sign-conversion -Wno-conversion -Wno-unsafe-loop-optimizations -Wno-cast-function-type -Wjump-misses-init -Wframe-larger-than=40096 -O2 -Wp,-D_FORTIFY_SOURCE=2 -fexceptions -fasynchronous-unwind-tables -fdiagnostics-show-option -funit-at-a-time -fipa-pure-const -Wno-suggest-attribute=pure -Wno-suggest-attribute=const -mms-bitfields -mms-bitfields -mms-bitfields -MD -MQ 'src/25a6634@@gvnc-1.0@sha/vncconnection.c.obj' -MF 'src/25a6634@@gvnc-1.0@sha/vncconnection.c.obj.d' -o 'src/25a6634@@gvnc-1.0@sha/vncconnection.c.obj' -c ../src/vncconnection.c In file included from ../src/vncconnection.c:57: ../src/dh.h:25:10: fatal error: gcrypt.h: No such file or directory #include <gcrypt.h> ^~~~~~~~~~ compilation terminated. [19/50] Compiling C object 'src/25a6634@@gvnc-1.0@sha/vncbaseframebuffer.c.obj'. ninja: build stopped: subcommand failed. Build step 'Execute shell' marked build as failure